Fldigi install errors

Keith Kaiser
 

Below is my latest attempt to install fldigi on a Raspberry Pi running a new copy of Buster. This is not an upgrade this is an initial install. Anyone have an idea what is causing this issue?



pi@D-KKloud:~/fldigi-4.1.09 $ make
Making all in po
make[1]: Entering directory '/home/pi/fldigi-4.1.09/po'
make[1]: Leaving directory '/home/pi/fldigi-4.1.09/po'
Making all in doc
make[1]: Entering directory '/home/pi/fldigi-4.1.09/doc'
make[1]: Nothing to be done for 'all'.
make[1]: Leaving directory '/home/pi/fldigi-4.1.09/doc'
Making all in src
make[1]: Entering directory '/home/pi/fldigi-4.1.09/src'
make  all-recursive
make[2]: Entering directory '/home/pi/fldigi-4.1.09/src'
make[3]: Entering directory '/home/pi/fldigi-4.1.09/src'
  CXX      network/fldigi-xmlrpc.o
In file included from /usr/include/c++/8/map:60,
                 from ./xmlrpcpp/XmlRpcServer.h:25,
                 from ./include/xmlrpc.h:27,
                 from network/xmlrpc.cxx:33:

.... lots of stuff here ….

CXX      dialogs/fldigi-confdialog.o
{standard input}: Assembler messages:
{standard input}:178943: Warning: end of file not at end of a line; newline ins$
{standard input}:180263: Warning: missing operand; zero assumed
{standard input}: Error: open CFI at the end of file; missing .cfi_endproc dire$
g++: fatal error: Killed signal terminated program cc1plus
compilation terminated.
make[3]: *** [Makefile:5396: dialogs/fldigi-confdialog.o] Error 1
make[3]: Leaving directory '/home/pi/fldigi-4.1.09/src'
make[2]: *** [Makefile:8106: all-recursive] Error 1
make[2]: Leaving directory '/home/pi/fldigi-4.1.09/src'
make[1]: *** [Makefile:1667: all] Error 2
make[1]: Leaving directory '/home/pi/fldigi-4.1.09/src'
make: *** [Makefile:469: all-recursive] Error 1
pi@D-KKloud:~/fldigi-4.1.09 $


Keith, WA0̷TJT



Join nbems@groups.io to automatically receive all group messages.